Org.apache.spark.sparkexception job aborted due to stage failure

Hi Team, I am writing a Delta file in ADL-Gen2 from ADF for multiple files dynamically using Dataflows activity. For the initial run i am able to read the file from Azure DataBricks . But when i rerun the pipeline with truncate and load i am getting…

Org.apache.spark.sparkexception job aborted due to stage failure. You need to change this parameter in the cluster configuration. Go into the cluster settings, under Advanced select spark and paste spark.driver.maxResultSize 0 (for unlimited) or whatever the value suits you. Using 0 is not recommended. You should optimize the job by re partitioning. See the links below for more information: https://docs ...

When I run the demo : from pyspark.ml.linalg import Vectors import tempfile conf = SparkConf().setAppName('ansonzhou_test').setAll([ ('spark.executor.memory', '8g ...

Jan 10, 2020 · Teams. Q&A for work. Connect and share knowledge within a single location that is structured and easy to search. Learn more about Teams SparkException: Python worker failed to connect back when execute spark action 4 Pyspark. spark.SparkException: Job aborted due to stage failure: Task 0 in stage 15.0 failed 1 times, java.net.SocketException: Connection resetAccording to the content of README.md of GitHub repo Azure/azure-cosmosdb-spark as the figure below, you may should switch to use the latest jar file azure-cosmosdb-spark_2.4.0_2.11-1.4.0-uber.jar in it. And the maven repo for Azure CosmosDB Spark has released to 1.4.1 version, as the figure below.报错如下: : org.apache.spark.SparkException: Job aborted due to stage failure: Task 0 in stage 3.0 failed 4 times, most recent failure: ...1 Answer. Sorted by: 1. You need to create an RDD of type RDD [Tuple [str]] but in your code, the line: rdd = spark.sparkContext.parallelize (comments) returns RDD [str] which then fails when you try to convert it to dataframe with that given schema. Try modifying that line to:

I'm new to spark, and was trying to run the example JavaSparkPi.java, it runs well, but because i have to use this in another java s I copy all things from main to a method in the class and try to call the method in main, it saids . org.apache.spark.SparkException: Job aborted: Task not serializable: java.io.NotSerializableExceptionI installed apache-spark and pyspark on my machine (Ubuntu), and in Pycharm, I also updated the environment variables (e.g. spark_home, pyspark_python). I'm trying to do: import os, sys os.environ['1. "Accept timed out" generally points to a problem with your spark instance. It may be overloaded or not enough resources (memory/cpu) to start your job or it might be a temporary network issue. You can monitor you jobs on Spark UI. Also there is some issue with your code.Viewed 8k times. 1. I am trying to do some computation using UDFs. But after the computation when i try to convert the pyspark dataframe to pandas it gives me org.apache.spark.SparkException: Exception thrown in awaitResult: I will put down the reproducible code. import pandas as pd import numpy as np import time n = 10000 sample_df = pd ...I am running spark jobs using datafactory in azure databricks. My cluster vesion is 9.1 LTS ML (includes Apache Spark 3.1.2, Scala 2.12). I am writing data on azure blob storage. While writing job ...In my project i am using spark-Cassandra-connector to read the from Cassandra table and process it further into JavaRDD but i am facing issue while processing Cassandra row to javaRDD.Nov 28, 2019 · : org.apache.spark.SparkException: Job aborted due to stage failure: Task 9 in stage 47.0 failed 4 times, most recent failure: Lost task 9.3 in stage 47.0 (TID 2256, ip-172-31-00-00.eu-west-1.compute.internal, executor 10): org.apache.spark.sql.execution.QueryExecutionException: Parquet column cannot be converted in file s3a://bucket/prod ... Teams. Q&A for work. Connect and share knowledge within a single location that is structured and easy to search. Learn more about Teams

May 2, 2016 · Teams. Q&A for work. Connect and share knowledge within a single location that is structured and easy to search. Learn more about Teams I am doing it using spark code. But when i try to run the code I get following exception org.apache.spark.SparkException: Job aborted due to stage failure: Task 2 in stage 1.0 failed 4 times, most recent failure: Lost task 2.3 in stage 1.0 (TID 9, XXXX.XXX.XXX.local): org.apache.spark.SparkException: Task failed while writing rows. Apache Spark; koukou. ... org.apache.spark.SparkException: Job aborted due to stage failure: Task 0 in stage 30.0 failed 1 times, most recent failure: Lost task 0.0 ...I'm new to spark, and was trying to run the example JavaSparkPi.java, it runs well, but because i have to use this in another java s I copy all things from main to a method in the class and try to call the method in main, it saids . org.apache.spark.SparkException: Job aborted: Task not serializable: java.io.NotSerializableException

Pollak pa66 gf30.

Sep 21, 2021 · I am trying to solve the problems from O'Reilly book of Learning Spark. Below part of code is working fine from pyspark.sql.types import * from pyspark.sql import SparkSession from pyspark.sql.func... Teams. Q&A for work. Connect and share knowledge within a single location that is structured and easy to search. Learn more about TeamsOct 31, 2022 · I am trying to run a pyspark job but it is failing on RDD collectAndServe method. I do not have any memory issues. I have all updated jars in my jars folder. Python worker is crashing with below er... SparkException:执行 spark 操作时 Python 工作线程无法连接回spark.SparkException: Python worker failed to connect back.问问题当我尝试在 pyspark 执行此命令行时from pyspark import SparkConf, SparkContext# 创建SparkConf和SparkContextconf = SparkConf().setMaster("local").setAppName("licFeb 1, 2017 · Pyspark. spark.SparkException: Job aborted due to stage failure: Task 0 in stage 15.0 failed 1 times, java.net.SocketException: Connection reset Hot Network Questions Main character is charged an exorbitant computing bill after abusing his uploaded consciousness powers

Sep 1, 2022 · use dbr version : 10.4 LTS (includes Apache Spark 3.2.1, Scala 2.12) for spark configuartion edit the spark tab by editing the cluster and use below code there. "spark.sql.ansi.enabled false" hello everyone I am working on PySpark Python and I have mentioned the code and getting some issue, I am wondering if someone knows about the following issue? windowSpec = Window.partitionBy(Aug 9, 2021 · You need to change this parameter in the cluster configuration. Go into the cluster settings, under Advanced select spark and paste spark.driver.maxResultSize 0 (for unlimited) or whatever the value suits you. Using 0 is not recommended. You should optimize the job by re partitioning. See the links below for more information: https://docs ... But failed with 10GB file. My dataproc has 1 master with 4CPU, 26GB memory, 500GB disk. 5 workers with same config. I guess it should've been able to handle 10GB data. My command is toDatabase.repartition (10).write.json ("gs://mypath") Error is. org.apache.spark.SparkException: Job aborted. at org.apache.spark.sql.execution.datasources ...Exception in thread "main" org.apache.spark.SparkException : Job aborted due to stage failure: Task 3 in stage 0.0 failed 4 times, most recent failure: Lost task 3.3 in stage 0.0 (TID 14, 192.168.10.38): ExecutorLostFailure (executor 3 lost) Driver stacktrace:org.apache.spark.SparkException: Job aborted due to stage failure: Task 73 in stage 979.0 failed 1 times, most recent failure: Lost task 73.0 in stage 979.0 (TID 32624, localhost, executor driver): org.apache.spark.SparkException: Failed to execute user defined function($anonfun$4: (struct<other_double_VectorAssembler_a2059b1f0691:double ...Sep 21, 2021 · I am trying to solve the problems from O'Reilly book of Learning Spark. Below part of code is working fine from pyspark.sql.types import * from pyspark.sql import SparkSession from pyspark.sql.func... org.apache.spark.SparkException: Job aborted due to stage failure: Task 73 in stage 979.0 failed 1 times, most recent failure: Lost task 73.0 in stage 979.0 (TID 32624, localhost, executor driver): org.apache.spark.SparkException: Failed to execute user defined function($anonfun$4: (struct<other_double_VectorAssembler_a2059b1f0691:double ...You need to change this parameter in the cluster configuration. Go into the cluster settings, under Advanced select spark and paste spark.driver.maxResultSize 0 (for unlimited) or whatever the value suits you. Using 0 is not recommended. You should optimize the job by re partitioning. See the links below for more information: https://docs ...

If issue persists, please contact Microsoft support for further assistance","Details":"org.apache.spark.SparkException: Job aborted due to stage failure: Task 320 in stage 21.0 failed 1 times, most recent failure: Lost task 320.0 in stage 21.0 (TID 1297, vm-42929650, executor 1): ExecutorLostFailure (executor 1 exited caused by one of the ...

Oct 30, 2018 · You need to change this parameter in the cluster configuration. Go into the cluster settings, under Advanced select spark and paste spark.driver.maxResultSize 0 (for unlimited) or whatever the value suits you. Using 0 is not recommended. You should optimize the job by re partitioning. calling o110726.collectToPython. : org.apache.spark.SparkException: Job aborted due to stage failure: Task 7 in stage 1971.0 failed 4 times, most recent failure: Lost task 7.3 in stage 1971.0 (TID 31298) (10.54.144.30 executor 7):org.apache.spark.SparkException: Job aborted due to stage failure: Task 29 in stage 0.0 failed 4 times, most recent failure: Lost task 29.3 in stage 0.0 (TID 92, 10.252.252.125, executor 23): ExecutorLostFailure (executor 23 exited caused by one of the running tasks) Reason: Remote RPC client disassociated.Nov 28, 2019 · According to the content of README.md of GitHub repo Azure/azure-cosmosdb-spark as the figure below, you may should switch to use the latest jar file azure-cosmosdb-spark_2.4.0_2.11-1.4.0-uber.jar in it. And the maven repo for Azure CosmosDB Spark has released to 1.4.1 version, as the figure below. org.apache.spark.SparkException: Job aborted due to stage failure: ShuffleMapStage 20 (repartition at data_prep.scala:87) has failed the maximum allowable number of times: 4. Most recent failure reason: org.apache.spark.shuffle.MetadataFetchFailedException: Missing an output location for shuffle 9Check Apache Spark installation on Windows 10 steps. Use different versions of Apache Spark (tried 2.4.3 / 2.4.2 / 2.3.4). Disable firewall windows and antivirus that I have installed. Tried to initialize the SparkContext manually with sc = spark.sparkContext (found this possible solution at this question here in Stackoverflow, didn´t work for ...Based on the code , am not seeing anything wrong . Still you can analysis this issue based on the following data related . Make sure 4th line lines rdd has the data based on the collect().Go into the cluster settings, under Advanced select spark and paste spark.driver.maxResultSize 0 (for unlimited) or whatever the value suits you. Using 0 is not recommended. You should optimize the job by re partitioning. For more details, refer "Spark Configurations - Application Properties". Hope this helps. Do let us know if you any further ...

Original tommy.

23 signs you.

Feb 23, 2022 · I am running spark jobs using datafactory in azure databricks. My cluster vesion is 9.1 LTS ML (includes Apache Spark 3.1.2, Scala 2.12). I am writing data on azure blob storage. While writing job ... Jan 10, 2020 · Teams. Q&A for work. Connect and share knowledge within a single location that is structured and easy to search. Learn more about Teams Exception in thread "main" org.apache.spark.SparkException: Job aborted due to stage failure: Task 0 in stage 2.0 failed 1 times, most recent failure: Lost task 0.0 in stage 2.0 (TID 119, localhost, executor driver): ExecutorLostFailure (executor driver exited caused by one of the running tasks) Reason: Executor heartbeat timed out after 128839 ...Here are some ideas to fix this error: Serializable the class. Declare the instance only within the lambda function passed in map. Make the NotSerializable object as a static and create it once per machine. Call rdd.forEachPartition and create the NotSerializable object in there like this: rdd.forEachPartition (iter -> { NotSerializable ... org.apache.spark.SparkException: Job aborted due to stage failure: Task 1 in stage 188.0 failed 4 in Data Engineering a month ago; SparkException: There is no Credential Scope. in Data Governance a month agoSolution 1. Check your environment variables. You are getting “py4j.protocol.Py4JError: org.apache.spark.api.python.PythonUtils.getEncryptionEnabled does not exist in the JVM” due to Spark environemnt variables are not set right. Hi! I run 2 to spark an option SPARK_MAJOR_VERSION=2 pyspark --master yarn --verbose spark starts, I run the SC and get an error, the field in the table exactly there. not the problem SPARK_MAJOR_VERSION=2 pyspark --master yarn --verbose SPARK_MAJOR_VERSION is set to 2, using Spark2 Python 2.7.12 ...Spark任务:Job aborted due to stage failure: Task 0 in stage 2.0 failed 4 times, most recent failure问题 跑Spark任务时报错,复制任务id(application_1111_222)到yarn页面中检索,发现报以下错误: Job aborted due to stage failure: Task 0 in stage 2.0 failed 4 times, most recent failure 使用sc读取Oct 6, 2016 · Teams. Q&A for work. Connect and share knowledge within a single location that is structured and easy to search. Learn more about Teams ….

Solve : org.apache.spark.SparkException: Job aborted due to stage failure 1 Spark Error: Executor XXX finished with state EXITED message Command exited with code 1 exitStatus 1Here are some ideas to fix this error: Serializable the class. Declare the instance only within the lambda function passed in map. Make the NotSerializable object as a static and create it once per machine. Call rdd.forEachPartition and create the NotSerializable object in there like this: rdd.forEachPartition (iter -> { NotSerializable ... Jan 4, 2019 · Exception in thread "main" org.apache.spark.SparkException: Job aborted due to stage failure: Task 0 in stage 2.0 failed 1 times, most recent failure: Lost task 0.0 in stage 2.0 (TID 119, localhost, executor driver): ExecutorLostFailure (executor driver exited caused by one of the running tasks) Reason: Executor heartbeat timed out after 128839 ... Here is a method to parallelize serial JDBC reads across multiple spark workers... you can use this as a guide to customize it to your source data ... basically the main prerequisite is to have some kind of unique key to split on.org.apache.spark.SparkException: Job aborted due to stage failure: Task 2 in stage 0.0 failed 4 times, most recent failure: Lost task 2.3 in stage 0.0 Updating the dependancy in SBT solved the problem.If issue persists, please contact Microsoft support for further assistance","Details":"org.apache.spark.SparkException: Job aborted due to stage failure: Task 320 in stage 21.0 failed 1 times, most recent failure: Lost task 320.0 in stage 21.0 (TID 1297, vm-42929650, executor 1): ExecutorLostFailure (executor 1 exited caused by one of the ...Feb 24, 2022 · Caused by: org.apache.spark.SparkException: Job aborted due to stage failure: Task 5 in stage 76.0 failed 4 times, most recent failure: Lost task 5.3 in stage 76.0 (TID 2334) (10.139.64.5 executor 6): com.databricks.sql.io.FileReadException: Error while reading file <File_Path> It is possible the underlying files have been updated. 1. "Accept timed out" generally points to a problem with your spark instance. It may be overloaded or not enough resources (memory/cpu) to start your job or it might be a temporary network issue. You can monitor you jobs on Spark UI. Also there is some issue with your code. Org.apache.spark.sparkexception job aborted due to stage failure, Apr 19, 2015 · org.apache.spark.SparkException: Job aborted due to stage failure: Task 7 in stage 0.0 failed 4 times, most recent failure: Lost task 7.3 in stage 0.0 (TID 11, fujitsu11.inevm.ru):java.lang.ClassNotFoundException: maven.maven1.Document java.net.URLClassLoader$1.run (URLClassLoader.java:366) java.net.URLClassLoader$1.run (URLClassLoader.java:35... , Nov 11, 2021 · 1 Answer. PySpark DF are lazy loading. When you call .show () you are asking the prior steps to execute and anyone of them may not work, you just can't see it until you call .show () because they haven't executed. I go back to earlier steps and call .collect () on each operation of the DF. This will at least allow you to isolate where the bad ... , org.apache.spark.SparkException: Job aborted due to stage failure: Task in stage failed,Lost task in stage : ExecutorLostFailure (executor 4 lost) 12 org.apache.spark.SparkException: Job aborted due to stage failure: Task 98 in stage 11.0 failed 4 times, Exception in thread "main" org.apache.spark.SparkException : Job aborted due to stage failure: Task 3 in stage 0.0 failed 4 times, most recent failure: Lost task 3.3 in stage 0.0 (TID 14, 192.168.10.38): ExecutorLostFailure (executor 3 lost) Driver stacktrace:, You may not have right permissions. I have the same problem when I use a docker image jupyter/pyspark-notebook to run an example code of pyspark, and it was solved by using root within the container., Nov 1, 2017 · Saved searches Use saved searches to filter your results more quickly , org.apache.spark.SparkException: **Job aborted due to stage failure: Task 0 in stage 1.0 failed 1 times, most recent failure: Lost task 0.0 in stage 1.0 (TID 1 ..., Exception logs: 2018-08-26 16:15:02 INFO DAGScheduler:54 - ResultStage 0 (parquet at ReadDb2HDFS.scala:288) failed in 1008.933 s due to Job aborted due to stage failure: Task 0 in stage 0.0 failed 4 times, most recent failure: Lost task 0.3 in stage 0.0 (TID 3, master, executor 4): ExecutorLostFailure (executor 4 exited caused by one of the ..., Jun 9, 2020 · Our reports and datasets imports data from Databricks Spark Delta tables using the Spark connector into our Premium P1 capacity. We're using incremental refresh for the larger (fact) tables, but we're having trouble with the initial refresh after publishing the pbix file. When refreshing large datasets it often fails after 30-60 minutes with ... , I am trying to run a pyspark job but it is failing on RDD collectAndServe method. I do not have any memory issues. I have all updated jars in my jars folder. Python worker is crashing with below er..., In my project i am using spark-Cassandra-connector to read the from Cassandra table and process it further into JavaRDD but i am facing issue while processing Cassandra row to javaRDD., Sep 14, 2020 · Hi Team, I am writing a Delta file in ADL-Gen2 from ADF for multiple files dynamically using Dataflows activity. For the initial run i am able to read the file from Azure DataBricks . But when i rerun the pipeline with truncate and load i am getting… , Jul 17, 2020 · Caused by: org.apache.spark.SparkException: Job aborted due to stage failure: Serialized task 2:0 was 155731289 bytes, which exceeds max allowed: spark.rpc.message.maxSize (134217728 bytes). Consider increasing spark.rpc.message.maxSize or using broadcast variables for large values. , Problem Databricks throws an error when fitting a SparkML model or Pipeline: org.apache.spark.SparkException: Job aborted due to stage failure: Task 0 in s, May 15, 2017 · : org.apache.spark.SparkException: Job aborted due to stage failure: Serialized task 302987:27 was 139041896 bytes, which exceeds max allowed: spark.akka.frameSize (134217728 bytes) - reserved (204800 bytes). , Apache Spark; koukou. ... org.apache.spark.SparkException: Job aborted due to stage failure: Task 0 in stage 30.0 failed 1 times, most recent failure: Lost task 0.0 ..., Use the DF transformations to create the statistics you need, THEN call collect/show to get the result back to the driver. That way you are only downloading the stats, not the full data., Sep 1, 2022 · one can solve this job aborted error, either changing the "spark configuration" in the cluster or either use "try_cast" function when you are getting this error while inserting data from one table to another table in databricks. use dbr version : 10.4 LTS (includes Apache Spark 3.2.1, Scala 2.12) , Sep 14, 2020 · Hi Team, I am writing a Delta file in ADL-Gen2 from ADF for multiple files dynamically using Dataflows activity. For the initial run i am able to read the file from Azure DataBricks . But when i rerun the pipeline with truncate and load i am getting… , I am running spark jobs using datafactory in azure databricks. My cluster vesion is 9.1 LTS ML (includes Apache Spark 3.1.2, Scala 2.12). I am writing data on azure blob storage. While writing job ..., The copy activity was interrupted part way through as the source database went offline which then caused the failure to complete writing the files properly. These were easily found as they were the most recently modified files., Apr 9, 2021 · Viewed 8k times. 1. I am trying to do some computation using UDFs. But after the computation when i try to convert the pyspark dataframe to pandas it gives me org.apache.spark.SparkException: Exception thrown in awaitResult: I will put down the reproducible code. import pandas as pd import numpy as np import time n = 10000 sample_df = pd ... , Here is a method to parallelize serial JDBC reads across multiple spark workers... you can use this as a guide to customize it to your source data ... basically the main prerequisite is to have some kind of unique key to split on., Pyspark. spark.SparkException: Job aborted due to stage failure: Task 0 in stage 15.0 failed 1 times, java.net.SocketException: Connection reset Hot Network Questions Main character is charged an exorbitant computing bill after abusing his uploaded consciousness powers, strange org.apache.spark.SparkException: Job aborted due to stage failure again. I'm trying to deploy spark application on standalone mode. In this application I'm training Naive Bayes classifier by using tf-idf vectors. I wrote application in similar manner to this post ( Spark MLLib TFIDF implementation for LogisticRegression ) The difference ..., Apr 8, 2019 · scala - org.apache.spark.SparkException: Job aborted due to stage failure: Task 98 in stage 11.0 failed 4 times - Stack Overflow org.apache.spark.SparkException: Job aborted due to stage failure: Task 98 in stage 11.0 failed 4 times Ask Question Asked 4 years, 4 months ago Modified 4 years, 4 months ago Viewed 46k times , Mar 23, 2014 · FYI in Spark 2.4 a lot of you will probably encounter this issue. Kryo serialization has gotten better but in many cases you cannot use spark.kryo.unsafe=true or the naive kryo serializer. For a quick fix try changing the following in your Spark configuration spark.kryo.unsafe="false" OR. spark.serializer="org.apache.spark.serializer ... , You may not have right permissions. I have the same problem when I use a docker image jupyter/pyspark-notebook to run an example code of pyspark, and it was solved by using root within the container., org.apache.spark.SparkException: Job aborted due to stage failure: Task XXX in stage YYY failed 4 times, most recent failure: Lost task XXX in stage YYY (TID ZZZ, ip-xxx-xx-x-xxx.compute.internal, executor NNN): ExecutorLostFailure (executor NNN exited caused by one of the running tasks) Reason: ... 解決方法 理由コードの検索, Sep 20, 2021 · I've setted up pyspark on google colab using this tutorial from towardsdatascience. It runs well until it fails on trying to use IDF from pyspark.ml.feature import IDF idf = IDF(inputCol='hash', , I am trying to run a pyspark job but it is failing on RDD collectAndServe method. I do not have any memory issues. I have all updated jars in my jars folder. Python worker is crashing with below er..., strange org.apache.spark.SparkException: Job aborted due to stage failure again. I'm trying to deploy spark application on standalone mode. In this application I'm training Naive Bayes classifier by using tf-idf vectors. I wrote application in similar manner to this post ( Spark MLLib TFIDF implementation for LogisticRegression ) The difference ..., Nov 28, 2019 · : org.apache.spark.SparkException: Job aborted due to stage failure: Task 9 in stage 47.0 failed 4 times, most recent failure: Lost task 9.3 in stage 47.0 (TID 2256, ip-172-31-00-00.eu-west-1.compute.internal, executor 10): org.apache.spark.sql.execution.QueryExecutionException: Parquet column cannot be converted in file s3a://bucket/prod ...